{"text_format":"1","workbook":"xlsx","n_sheets":16,"sheets":["ePermitting ROI Calculator Home","Time to Market Start","Time to Market Inputs","Time to Market Results","Time to Market Background Calcs","Trusted Transactions Start","Trusted Transactions Inputs","Trusted Transactions Results","Trusted Trans. Background Calcs","Right Info, Right Time Start","Right Info, Right Time Inputs","Right Info, Right Time Results","Right Info, Right Time Calcs","BEA1","BEA2","Text Options"],"not_rendered":{"charts":0,"images":4,"macros":1,"external_links":0,"defined_names":32,"comments":0,"pivot_tables":0},"unopened":[],"bounds":{"document_bytes":16777216,"sheet_cells":100000,"rows_first":2000,"rows_last":500,"rows_between":2000,"halvings":0,"cell_chars":16384,"cell_head_chars":4096},"cells_cut":0,"cells_raw":0,"read":"whole","date_system":"1900"}

{"sheet":"ePermitting ROI Calculator Home","index":0,"n_rows":18,"n_cols":4,"rows_kept":18,"cut":false,"hidden":false,"merged":[[1,2,1,4],[17,1,19,5],[0,1,0,5],[11,1,12,5]]}
[null,"ePermitting ROI Metrics Calculator"]
[]
[null,null,null,"Primary Metric"]
[null,null,null,"TIME TO MARKET"]
[]
[]
[]
[]
[]
[]
[]
[null,"Estimate gains in economic activity associated with reduced permit processing times. "]
[]
[]
[]
{"$rows_left_out":4}
{"sheet":"Time to Market Start","index":1,"n_rows":5,"n_cols":3,"rows_kept":5,"cut":false,"hidden":false,"merged":[[1,2,3,4],[4,2,16,4]]}
[]
[null,null,"ePERMITTING BENEFITS CALCULATOR:\n TIME TO MARKET METRIC"]
[]
[]
[null,null,"This tool allows states to estimate the benefits of reducing the processing time for environmental permits so that economic activity (construction, industrial, or commercial activity) can start sooner. \n\n\"Time to market\" refers to the schedule for starting business operations at a facility; permitting processes can increase the time to market (delay operations) for facilities. This delays economic activity. Reducing permit processing time can therefore: increase economic activity by ensuring that operations begin sooner, increase productivity and reduce permitting-related costs for permit applicants, and reduce scheduling uncertainty that can affect financing.  \n\nThis tool specifically measures the opportunity cost of lost economic activity associated with waiting for the final permit decision. Project benefits are measured as the dollar value of additional days of economic activity per year."]

{"sheet":"Time to Market Inputs","index":2,"n_rows":78,"n_cols":6,"rows_kept":78,"cut":false,"hidden":false,"merged":[[77,2,78,4],[75,2,75,3],[66,2,67,4],[68,2,74,4],[47,3,48,3],[57,2,63,4],[55,2,56,4],[64,2,64,3],[50,2,53,4],[44,5,46,5],[1,2,2,3],[8,2,9,3],[45,2,46,2],[10,2,13,4],[33,2,33,4],[38,2,39,4],[42,2,43,4],[40,2,41,4],[37,2,37,4],[44,3,45,3],[15,2,27,4],[3,2,5,3],[35,2,35,4],[28,2,32,4]]}
[]
[null,null,"In which state is your project being implemented?"]
[]
[null,null,"Select a state from the drop down list by clicking in the cell below. Select 'United States' to use national-level data."]
[]
[]
[null,null,"State:"]
[]
[null,null,"What industry does the permit in question affect?"]
[]
[null,null,"This tool assesses the time to market benefits associated with projects that reduce processing times for a given permit. Select the industry regulated by your permit from the dropdown list in the cell below."]
[]
[]
[]
[null,null,"Commercial Construction"]
{"$rows_left_out":64}
{"sheet":"Time to Market Results","index":3,"n_rows":40,"n_cols":14,"rows_kept":40,"cut":false,"hidden":false,"merged":[[37,1,37,12],[38,1,38,12],[39,1,39,12],[2,1,2,11],[8,1,8,10],[16,2,17,7],[14,7,14,8],[18,7,18,8],[16,8,17,11],[22,10,23,12],[10,1,11,1],[10,2,11,6],[24,5,24,8],[26,8,33,11],[35,1,35,5],[31,1,31,5],[34,7,36,12],[28,1,28,2],[29,3,30,6],[29,0,29,2],[32,0,32,5],[34,1,34,5],[31,6,31,7]]}
[]
[]
[null,"Beyond ROI Metrics: Time to Market"]
[]
[null,"Processing times for permit approvals can prevent facilities from engaging in economic activity."]
[null,"This tool calculates additional economic activity from reduced permit processing time."]
[]
[null,"The World Bank estimates that the average U.S. permit processing time for commercial construction is 81 days.1"]
[]
[]
[null,"In",{"$f":"IF(the_tm=1,\"the \",\"\")&state_tm&\":\"","v":":"}]
[]
[null,null,null,null,null,null,null,null,null,null,null,null,null,{"$f":"'Time to Market Background Calcs'!E7","v":0}]
[null,4,"A day of economic activity in the",null,null,null,{"$f":"TRIM(LOWER(industry_tm))&\" sector in \"&IF(the_tm=1,\"the \",\"\")&state_tm","v":" sector in "},null,null,null,null,null,null,{"$f":"'Time to Market Background Calcs'!E6","v":0}]
[null,null,null,null,null,null,"is worth",{"$f":"IF('Time to Market Background Calcs'!E19<100,DOLLAR('Time to Market Background Calcs'!E19,1),DOLLAR('Time to Market Background Calcs'!E19,0))&\" million\"","v":{"$error":"#N/A"}},null," in GDP.2",null,null,null,81]
{"$rows_left_out":26}
{"sheet":"Time to Market Background Calcs","index":4,"n_rows":68,"n_cols":5,"rows_kept":68,"cut":false,"hidden":false,"merged":[[53,1,55,1],[61,2,61,4],[62,1,65,1],[40,2,40,4],[41,1,43,1],[52,2,52,4],[41,2,42,4],[49,3,49,4],[58,3,58,4],[55,2,57,4],[53,2,54,4],[62,2,63,4],[65,3,66,4],[67,3,69,4],[5,2,5,3],[6,2,6,3],[19,2,20,4],[21,2,22,4],[23,3,24,4],[28,2,29,4],[31,2,32,4],[43,2,47,4],[30,2,30,4],[33,2,35,4],[25,3,27,4],[38,2,38,4],[36,2,37,4]]}
[]
[null,null,null,"State:",{"$f":"IF('Time to Market Inputs'!D7=\"\",\"\",'Time to Market Inputs'!D7)","v":""}]
[null,null,null,"Industry:",{"$f":"industry_tm","v":0}]
[null,null,"(A)",{"$f":"IF(ISBLANK(E3)=TRUE,\"\",\"  Percent of \"&TRIM(LOWER(E3))&\" in \"&E2&\":\")","v":"  Percent of 0 in :"},{"$f":"IF('Time to Market Inputs'!E46=\"\",\"\",'Time to Market Inputs'!E46)","v":""}]
[null,null,"(B)",{"$f":"\" \"&TRIM(E3)&\" establishments in \"&E2&\":\"","v":" 0 establishments in :"},{"$f":"IF('Time to Market Inputs'!E49=\"\",\"\",'Time to Market Inputs'!E49)","v":""}]
[null,null,"Days for permit approval:",null,{"$f":"'Time to Market Inputs'!E65","v":0}]
[null,"user inputs","Days for permit approval:",null,{"$f":"'Time to Market Inputs'!E76","v":0}]
[null,"outputs",null,"Change in days",{"$f":"E6-E7","v":0}]
[null,null,null,"Total establishments in state:",{"$f":"IFERROR(INDEX('BEA2'!F2:F1037,MATCH(E2&E3,'BEA2'!C2:C1037&'BEA2'!D2:D1037,0)),\"\")","v":""}]
[null,null,null,"Total GDP",{"$f":"INDEX('BEA2'!E2:E1037,MATCH(E2&E3,'BEA2'!C2:C1037&'BEA2'!D2:D1037,0))","v":{"$error":"#N/A"}}]
[null,null,null,null,{"$f":"E10*E17","v":{"$error":"#N/A"}}]
[null,null,null,"One-Facility GDP",{"$f":"E10/E9","v":{"$error":"#N/A"}}]
[null,null,null,"One-facility-day",{"$f":"E12/365","v":{"$error":"#N/A"}}]
[null,null,null,"Total facilities in calculation",{"$f":"IF(E5=\"\",(E4*E9),E5)","v":{"$error":"#VALUE!"}}]
[null,null,null,null,{"$f":"E16*Change_permit_time","v":{"$error":"#N/A"}}]
{"$rows_left_out":54}
{"sheet":"Trusted Transactions Start","index":5,"n_rows":10,"n_cols":2,"rows_kept":10,"cut":false,"hidden":false,"merged":[[1,1,2,3],[4,1,8,3],[9,1,14,3]]}
[]
[null,"ePERMITTING BENEFITS CALCULATOR:\nTRUSTED TRANSACTIONS METRIC"]
[]
[]
[null,"Trusted transactions include more efficient, transparent interfaces and systems, which can reduce the high cost of negative and/or defensive interactions between the regulated community and the regulating agency. The benefits to the regulated community include increased certainty by the applicant that interactions will result in positive, productive outcomes with high confidence in the process, rather than protracted exchanges with uncertain timing and/or results. "]
[]
[]
[]
[]
[null,"This metric quantifies the value to regulated entities of realigning compliance staff to additional value-added use. This tool includes several national averages for compliance staff time and wages, which can be used or customized by the user. The only inputs required are the number of firms affected by the relevant permit/requirement and the estimated percent of compliance staff time that can be repurposed to value-added use due to the permit process improvement.  "]

{"sheet":"Trusted Transactions Inputs","index":6,"n_rows":38,"n_cols":4,"rows_kept":38,"cut":false,"hidden":false,"merged":[[14,1,15,3],[12,1,12,2],[1,1,2,3],[10,1,11,3],[3,1,4,3],[5,1,6,3],[33,1,35,3],[37,1,37,2],[25,1,27,3],[21,0,21,2],[16,1,19,3],[23,1,24,3],[31,1,32,3],[29,1,29,2]]}
[]
[null,"TRUSTED TRANSACTIONS"]
[]
[null,"In which state is your project being implemented?"]
[]
[null,"Select a state from the drop down list by clicking in the cell below. Select 'United States' to use national-level data."]
[]
[]
[null,"State:"]
[]
[null,"How many firms are affected by your ePermitting streamlining?"]
[]
[null,"Enter number of firms affected:"]
[]
[null,"Weekly Compliance Time Before Process Improvement"]
{"$rows_left_out":24}
{"sheet":"Trusted Transactions Results","index":7,"n_rows":35,"n_cols":14,"rows_kept":35,"cut":false,"hidden":false,"merged":[[32,1,33,12],[34,1,39,12],[11,7,11,10],[15,7,15,10],[21,6,21,8],[2,1,2,11],[9,1,10,1],[11,1,14,1],[3,1,6,11],[27,12,30,12],[26,1,26,5],[24,12,25,12],[27,1,27,5],[29,1,29,5],[24,1,24,5],[30,0,30,5]]}
[]
[]
[null,"Beyond ROI Metrics: Trusted Transactions"]
[null,"More efficient, transparent interfaces and systems can reduce the high cost of interactions between the regulated firms and the regulating agency. An increase in trusted transactions can allow regulated firms to realign compliance staff towards additional value-added use, improving economic efficiency."]
[]
[]
[]
[null,"Thomson Reuters estimates that each firm spends an average of 3.5 hours per week on compliance.1"]
[null,"In",{"$f":"IF(the_tt=1,\"the \",\"\")&state_tt&\":\"","v":":"}]
[]
[null,null,"One year of regulatory compliance for firms considered in the analysis",null,null,null,null,null,null,{"$f":"\"in \"&IF(the_tt=1,\"the \",\"\")&state_tt","v":"in "},null,null,null,{"$f":"G31*52","v":0}]
[null,null,null,null,null,null,"costs",{"$f":"DOLLAR('Trusted Trans. Background Calcs'!F9,0)","v":"$0"},null,null,null,"in compliance labor.2",null,{"$f":"G30*52","v":182}]
[null,null,null,null,null,null,null,null,null,null,null,null,null,182]
[null,null,"One year of regulatory compliance for one firm considered in the analysis",null,null,null,null,null,null,null,{"$f":"\"in \"&IF(the_tt=1,\"the \",\"\")&state_tt","v":"in "},null,null,{"$f":"(3.5-G30)*G28*G27*52","v":0}]
[]
{"$rows_left_out":21}
{"sheet":"Trusted Trans. Background Calcs","index":8,"n_rows":44,"n_cols":6,"rows_kept":44,"cut":false,"hidden":false,"merged":[[12,1,13,3],[21,1,22,3],[24,1,24,3],[36,2,36,3],[41,2,41,3],[43,2,43,3],[14,1,14,3],[30,1,30,3],[38,1,38,3],[16,2,18,3],[33,2,34,3],[28,2,28,3],[26,2,26,3]]}
[]
[null,"Inputs",null,null,null,"Output Sheet"]
[null,"State",null,{"$f":"'Trusted Transactions Inputs'!C9","v":0},null,{"$f":"D3","v":0}]
[null,"Total Regulated Firms (number of permits)",null,{"$f":"'Trusted Transactions Inputs'!D13","v":0},null,{"$f":"D4","v":0}]
[null,"Weekly Compliance Time",null,{"$f":"'Trusted Transactions Inputs'!D22","v":3.5},null,3.5]
[null,"Annual Compliance Time",null,{"$f":"D5*52","v":182},null,182]
[null,"Average Compliance Staff Cost",null,{"$f":"'Trusted Transactions Inputs'!D30","v":48.48},null,48.48]
[null,"per Firm Annual Compliance cost",null,{"$f":"D7*D6","v":8823.3599999999988},null,8823.3599999999988]
[null,"Total Colorado Compliance costs",null,{"$f":"D8*D4","v":0},null,0]
[null,"Reduction in time",null,{"$f":"'Trusted Transactions Inputs'!D38","v":0},null,0]
[null,"Reduction in Compliance costs",null,{"$f":"D10*D9","v":0},null,0]
[]
[null,"RESULTS"]
[]
[null,"Trusted Transactions Benefits from Repurposing Compliance Staff"]
{"$rows_left_out":30}
{"sheet":"Right Info, Right Time Start","index":9,"n_rows":5,"n_cols":3,"rows_kept":5,"cut":false,"hidden":false,"merged":[[1,2,2,4],[4,2,15,4]]}
[]
[null,null,"ePERMITTING BENEFITS CALCULATOR:\n RIGHT INFO, RIGHT TIME METRIC"]
[]
[]
[null,null,"The right info, right time metric estimates benefits of reducing time spent by the public/industry on searching for/accessing data (e.g., online driver’s license renewals vs. in-person). This benefit results from the ability of the regulated community or public to pull high-quality information from a platform, rather than having to directly request information or otherwise interface with agency staff in order to make questions or needs known.  \n\nEase of use and enhanced access to information through electronic platforms reduces the time users spend searching for information, and minimizes the need to file formal requests to obtain data. Users have the flexibility to conduct transactions outside of business hours (as electronic platforms feature round-the-clock access) and save time by receiving information electronically. \n\n"]

{"sheet":"Right Info, Right Time Inputs","index":10,"n_rows":42,"n_cols":7,"rows_kept":42,"cut":false,"hidden":false,"merged":[[41,1,41,2],[33,1,33,2],[34,1,35,3],[36,1,39,3],[20,1,22,3],[27,1,28,3],[29,1,30,3],[23,1,25,2],[1,1,1,3],[13,1,13,2],[31,1,32,2],[9,1,11,3],[7,1,8,3],[18,1,19,3],[15,1,15,2],[2,1,3,3],[16,2,16,3]]}
[]
[null,"In which state is your project being implemented?"]
[null,"Select a staten from the drop down list by clicking in the cell below. Select 'United States' to use national-level data."]
[]
[]
[null,"State:"]
[]
[null,"Total Information Requests/Transactions Affected by Streamlining ePermitting Processes"]
[]
[null,"This metric uses the number of transactions affected by the ePermitting process improvements to determine the overall cost savings to the public and firms in your state. How many information requests or transactions do you conduct for the facilities/citizens considered in this analysis?"]
[]
[]
[]
[null,"Enter number of transactions/requests:"]
[null,null,null,null,null,null,"One day"]
{"$rows_left_out":28}
{"sheet":"Right Info, Right Time Results","index":11,"n_rows":37,"n_cols":13,"rows_kept":37,"cut":false,"hidden":false,"merged":[[34,1,35,11],[36,1,36,11],[24,11,27,11],[29,11,32,11],[32,0,32,5],[31,0,31,5],[27,6,27,8],[24,5,24,6],[2,1,2,10],[14,1,15,1],[4,1,6,10],[16,7,16,8],[22,6,22,7],[7,1,8,10],[12,7,12,8]]}
[]
[]
[null,"                 Beyond ROI Metrics: Right Info, Right Time"]
[]
[null,"It takes time for the public and/or firms to conduct transactions and request information from the government in-person. Providing the right information at the right time can increase economic efficiency."]
[]
[]
[null,"Deloitte estimates that the average time to request information or conduct a transaction with the government is 10 minutes (0.17 hours), extrapolating Deloitte's findings to the national population suggests that there are 1.16 billion such requests in the United States each year.1"]
[]
[null,"In",{"$f":"IF(the_rr=1,\"the \",\"\")&state_rr&\":\"","v":":"}]
[]
[null,4,"One year of transactions/requests for firms and citizens considered in this analysis",null,null,null,null,null,null,null,{"$f":"\"in \"&IF(the_rr=1,\"the \",\"\")&state_rr","v":"in "}]
[null,null,null,null,null,null,"takes",{"$f":"TEXT('Right Info, Right Time Calcs'!D8*'Right Info, Right Time Calcs'!D6,\"#,##0\")&\" hours\"","v":{"$error":"#VALUE!"}},null,"to complete.",null,null,{"$f":"G33*G29","v":0}]
[null,null,null,null,null,null,null,null,null,null,null,null,{"$f":"G32*G29","v":{"$error":"#VALUE!"}}]
[null,"4\n\n","One year of transactions/requests for firms and citizens considered in this analysis",null,null,null,null,null,null,null,{"$f":"\"in \"&IF(the_rr=1,\"the \",\"\")&state_rr","v":"in "},null,{"$f":"0.17*G32","v":{"$error":"#VALUE!"}}]
{"$rows_left_out":23}
{"sheet":"Right Info, Right Time Calcs","index":12,"n_rows":42,"n_cols":4,"rows_kept":42,"cut":false,"hidden":false,"merged":[[12,1,13,3],[28,2,28,3],[29,1,29,3],[38,2,39,3],[41,2,42,3],[22,1,22,3],[25,1,27,3],[14,2,16,3],[34,1,34,3],[31,2,32,3],[18,2,18,3],[20,1,21,3],[23,1,24,3],[35,1,36,3]]}
[]
[null,"Inputs"]
[null,"State",null,{"$f":"'Right Info, Right Time Inputs'!C6","v":0}]
[null,"State transactions",null,{"$f":"'Right Info, Right Time Inputs'!D14","v":0}]
[null,"Time period",null,{"$f":"'Right Info, Right Time Inputs'!D16","v":0}]
[null,"Total transactions",null,{"$f":"IF(D5=\"One day\",D4*365,IF(D5=\"One month\",D4*12,IF(D5=\"One year\",D4,\"\")))","v":""}]
[null,"Wage Rate",null,{"$f":"'Right Info, Right Time Inputs'!D33","v":17.809999999999999}]
[null,"Avg time of transaction",null,{"$f":"'Right Info, Right Time Inputs'!D25","v":0.17}]
[null,"Total cost",null,{"$f":"D8*D7*D6","v":{"$error":"#VALUE!"}}]
[null,"Reduction in time",null,{"$f":"'Right Info, Right Time Inputs'!D42","v":0}]
[null,"Total benefits",null,{"$f":"D10*D9","v":{"$error":"#VALUE!"}}]
[]
[null,"RESULTS"]
[]
[null,{"$f":"D9","v":{"$error":"#VALUE!"}},{"$f":"\"in annual costs associated with requesting information and conducting transactions in \"&IF(the_rr=1,\"the \",\"\")&state_rr&\" × \"&D10*100&\" percent reduction in total time\"","v":"in annual costs associated with requesting information and conducting transactions in  × 0 percent reduction in total time"}]
{"$rows_left_out":28}
{"sheet":"BEA1","index":13,"n_rows":53,"n_cols":4,"rows_kept":53,"cut":false,"hidden":false,"merged":[]}
["Area","State","Fips","Proportion of All Industry Total GDP 2015"]
["United States","US","00",1]
["Alabama","AL","01",1.1000000000000001E-2]
["Alaska","AK","02",3.0000000000000001E-3]
["Arizona","AZ","04",1.6E-2]
["Arkansas","AR","05",6.9999999999999993E-3]
["California","CA","06",0.13800000000000001]
["Colorado","CO","08",1.8000000000000002E-2]
["Connecticut","CT","09",1.3999999999999999E-2]
["Delaware","DE","10",4.0000000000000001E-3]
["District of Columbia","DC","11",6.9999999999999993E-3]
["Florida","FL","12",0.05]
["Georgia","GA","13",2.7999999999999997E-2]
["Hawaii","HI","15",4.0000000000000001E-3]
["Idaho","ID","16",4.0000000000000001E-3]
{"$rows_left_out":39}
{"sheet":"BEA2","index":14,"n_rows":1037,"n_cols":6,"rows_kept":1037,"cut":false,"hidden":false,"merged":[]}
["BEA code","ST","State","Industry","GDP (mil $)","Establishments"]
["1","US","United States","All industry total",17277550,7563085]
["3","US","United States","Agriculture, forestry, fishing, and hunting",203186,21844]
["6","US","United States","Mining",482710,29754]
["7","US","United States","Oil and gas extraction",338224,8256]
["10","US","United States","Utilities",283102,17962]
["11","US","United States","All construction",672052,667099]
["11.1","US","United States","Commercial construction",117213,37921]
["11.2","US","United States","Highway, street, and bridge construction",36568,9920]
["11.5","US","United States","Residential building construction",283590,159792]
["12","US","United States","All manufacturing",2099426,292543]
["16","US","United States","Primary metals manufacturing",58621,4558]
["26","US","United States","Food/beverage manufacturing",246305,26947]
["32","US","United States","Chemical products manufacturing",364589,13079]
["34","US","United States","Wholesale trade",1047883,416593]
{"$rows_left_out":1023}
{"sheet":"Text Options","index":15,"n_rows":58,"n_cols":10,"rows_kept":58,"cut":false,"hidden":false,"merged":[]}
["Tool","National:","state selected","Needs a \"the\"",null,null,null,"New Industry List",null,"New States List"]
["TM",{"$f":"IF(state_tm=\"United States\",1,0)","v":0},{"$f":"state_tm","v":0},{"$f":"IF(OR(C2=$C$9,C2=$C$10,C2=$C$11,C2=$C$12),1,0)","v":0},null,null,null,null,null,"United States"]
["TT",{"$f":"IF(state_tt=\"United States\",1,0)","v":0},{"$f":"state_tt","v":0},{"$f":"IF(OR(C3=$C$9,C3=$C$10,C3=$C$11,C3=$C$12),1,0)","v":0},null,null,null,"Commercial construction",null,"Alabama"]
["RR",{"$f":"IF(state_rr=\"United States\",1,0)","v":0},{"$f":"state_rr","v":0},{"$f":"IF(OR(C4=$C$9,C4=$C$10,C4=$C$11,C4=$C$12),1,0)","v":0},null,null,null,"----------------------------------------------------",null,"Alaska"]
[null,null,null,null,null,null,null,"All industry total",null,"Arizona"]
[null,null,null,null,null,null,null,"Mining",null,"Arkansas"]
[null,null,null,null,null,null,null,"Oil and gas extraction",null,"California"]
[null,null,"Regions needing a \"the\"",null,null,null,null,"Utilities",null,"Colorado"]
[null,null,"District of Columbia",null,null,null,null,"Waste management and remediation",null,"Connecticut"]
[null,null,"United States",null,null,null,null,"All construction",null,"Delaware"]
[null,null,"Northern Mariana Islands",null,null,null,null,"All manufacturing",null,"District of Columbia"]
[null,null,"U.S. Virgin Islands",null,null,null,null,"Primary metals manufacturing",null,"Florida"]
[null,null,null,null,null,null,null,"Chemical products manufacturing",null,"Georgia"]
[null,null,null,null,null,null,null,"Wholesale trade",null,"Hawaii"]
[null,null,null,null,null,null,null,"Retail trade",null,"Idaho"]
{"$rows_left_out":43}